Bismuth monoantimonide

Gas phase ion energetics data

Data compiled by: Henry M. Rosenstock, Keith Draxl, Bruce W. Steiner, and John T. Herron

Ionization energy determinations

IE (eV) Method Reference
8.0 ± 0.3EIKohl, Prusaczyk, et al., 1967

References

Kohl, Prusaczyk, et al., 1967
Kohl, F.J.; Prusaczyk, J.E.; Carlson, K.D., New gaseous molecules of the pnictides, J. Am. Chem. Soc., 1967, 89, 5501. [all data]