Barium trioxomolybdate

Gas phase ion energetics data

Data compiled by: Henry M. Rosenstock, Keith Draxl, Bruce W. Steiner, and John T. Herron

Ionization energy determinations

IE (eV) Method Reference
8.5 ± 0.5EIPupp, Yamdagni, et al., 1969

References

Pupp, Yamdagni, et al., 1969
Pupp, C.; Yamdagni, R.; Porter, R.F., Mass spectrometric study of the evaporation of BaMoO4 and BaWO4, J. Inorg. Nucl. Chem., 1969, 31, 2021. [all data]