Iron monohydroxide

Reaction thermochemistry data

Data compiled by: John E. Bartmess

Individual Reactions

FeO- + Hydrogen cation = HFeO

By formula: FeO- + H+ = HFeO

Quantity Value Units Method Reference Comment
Δr1527. ± 24.kJ/molD-EAEngelking and Lineberger, 1977gas phase

Gas phase ion energetics data

Data compiled as indicated in comments:
B - John E. Bartmess
LLK - Sharon G. Lias, Rhoda D. Levin, and Sherif A. Kafafi

Ionization energy determinations

IE (eV) Method Reference Comment
7.9 ± 0.02EIMurad, 1980LLK

De-protonation reactions

FeO- + Hydrogen cation = HFeO

By formula: FeO- + H+ = HFeO

Quantity Value Units Method Reference Comment
Δr1527. ± 24.kJ/molD-EAEngelking and Lineberger, 1977gas phase; B

References

Engelking and Lineberger, 1977
Engelking, P.C.; Lineberger, W.C., Laser photoelecton spectrometry of FeO-: Electron affinity, electronic state separations, and ground state vibrations of iron oxide, and a new ground state assignment, J. Chem. Phys., 1977, 66, 5054. [all data]

Murad, 1980
Murad, E., Thermochemical properties of gaseous FeO and FeOH, J. Chem. Phys., 1980, 73, 1381. [all data]