Ruthenium, η4-cyclobutadiene tricarbonyl

Gas phase ion energetics data

Data compiled by: Sharon G. Lias, John E. Bartmess, Joel F. Liebman, John L. Holmes, Rhoda D. Levin, and W. Gary Mallard

Ionization energy determinations

IE (eV) Method Reference Comment
7.8PEWorley, Webb, et al., 1982
8.27PEWorley, Webb, et al., 1982Vertical value

References

Worley, Webb, et al., 1982
Worley, S.D.; Webb, T.R.; Ou, T.Y., He(I) photoelectron spectra of three novel ruthenium tricarbonyl π complexes, J. Electron Spectrosc. Relat. Phenom., 1982, 28, 129. [all data]