Manganese,dicarbonyl(η5-2,4-cyclopentadien-1-yl)(phosphine)-

Gas phase ion energetics data

Data compiled as indicated in comments:
LLK - Sharon G. Lias, Rhoda D. Levin, and Sherif A. Kafafi
RDSH - Henry M. Rosenstock, Keith Draxl, Bruce W. Steiner, and John T. Herron

Ionization energy determinations

IE (eV) Method Reference Comment
7.28EIMuller, Fenderl, et al., 1971LLK
7.28 ± 0.05EIMuller and Fenderl, 1969RDSH

References

Muller, Fenderl, et al., 1971
Muller, J.; Fenderl, K.; Mertschenk, B., Die Donor-Akzeptor-Eigenschaften des Liganden Trifluorphosphin in Ubergangsmetallkomplexen, Chem. Ber., 1971, 104, 700. [all data]

Muller and Fenderl, 1969
Muller, J.; Fenderl, K., Massenspektren und Ionisierungspotentiale von C5H5Mn(CO)2PX3-Komplexen, J. Organometal. Chem., 1969, 19, 123. [all data]