OBeOBeO

Vibrational and/or electronic energy levels

Data compiled by: Marilyn E. Jacox

State:   X

Vib.
sym.
 No.   Approximate
 type of mode
 cm-1   Med.   Method   References

1482.5 T Ne IR Thompson and Andrews, 1994
Andrews, Chertihin, et al., 1996
1465.1 T Ar IR Thompson and Andrews, 1994
Andrews, Chertihin, et al., 1996

Additional references: Jacox, 1998, page 294

References

Thompson and Andrews, 1994
Thompson, C.A.; Andrews, L., Reactions of laser ablated Be atoms with O2: Infrared spectra of beryllium oxides in solid argon, J. Chem. Phys., 1994, 100, 12, 8689, https://doi.org/10.1063/1.466724 . [all data]

Andrews, Chertihin, et al., 1996
Andrews, L.; Chertihin, G.V.; Thompson, C.A.; Dillon, J.; Byrne, S.; Bauschlicher, C.W., Jr., Infrared Spectra and Quantum Chemical Calculations of Group 2 MO, J. Phys. Chem., 1996, 100, 24, 10088, https://doi.org/10.1021/jp953763v . [all data]

Jacox, 1998
Jacox, M.E., Vibrational and electronic energy levels of polyatomic transient molecules: supplement A, J. Phys. Chem. Ref. Data, 1998, 27, 2, 115-393, https://doi.org/10.1063/1.556017 . [all data]