Benzenemethanol, 4-methoxy-, formate

Normal alkane RI, non-polar column, temperature ramp

Data compiled by: NIST Mass Spectrometry Data Center, William E. Wallace, director

Column type Capillary
Active phase DB-1
Column length (m) 60.
Carrier gas He
Substrate
Column diameter (mm) 0.32
Phase thickness (μm) 0.25
Tstart (C) 60.
Tend (C) 220.
Heat rate (K/min) 3.
Initial hold (min)
Final hold (min)
I 1300.
ReferenceWerkhoff and Güntert, 1997
Comment MSDC-RI

References

Werkhoff and Güntert, 1997
Werkhoff, P.; Güntert, M., Identification of some ester compounds in bourbon vanilla beans, Lebensm. Wiss. Technol., 1997, 30, 4, 429-431, https://doi.org/10.1006/fstl.1996.0194 . [all data]