Cesium fluoride

Gas phase thermochemistry data

Quantity Value Units Method Reference Comment
Δfgas-890.10kJ/molReviewChase, 1998Data last reviewed in June, 1968
Quantity Value Units Method Reference Comment
gas,1 bar352.31J/mol*KReviewChase, 1998Data last reviewed in June, 1968

Gas Phase Heat Capacity (Shomate Equation)

Cp° = A + B*t + C*t2 + D*t3 + E/t2
H° − H°298.15= A*t + B*t2/2 + C*t3/3 + D*t4/4 − E/t + F − H
S° = A*ln(t) + B*t + C*t2/2 + D*t3/3 − E/(2*t2) + G
    Cp = heat capacity (J/mol*K)
    H° = standard enthalpy (kJ/mol)
    S° = standard entropy (J/mol*K)
    t = temperature (K) / 1000.

View plot Requires a JavaScript / HTML 5 canvas capable browser.

View table.

Temperature (K) 298. - 6000.
A 83.07876
B 0.056111
C -0.015268
D 0.001307
E -0.286074
F -915.8358
G 451.2277
H -890.1042
ReferenceChase, 1998
Comment Data last reviewed in June, 1968

Gas phase ion energetics data

Data compiled by: Henry M. Rosenstock, Keith Draxl, Bruce W. Steiner, and John T. Herron

Appearance energy determinations

Ion AE (eV) Other Products MethodReferenceComment
Cs2F+9.64 ± 0.05FPIBerkowitz, 1969

References

Chase, 1998
Chase, M.W., Jr., NIST-JANAF Themochemical Tables, Fourth Edition, J. Phys. Chem. Ref. Data, Monograph 9, 1998, 1-1951. [all data]

Berkowitz, 1969
Berkowitz, J., Photoionization of high-temperature vapors. V. Cesium halides; chemical shift of autoionization, J. Chem. Phys., 1969, 50, 3503. [all data]