Tritunsten nonachloride

Gas phase ion energetics data

Data compiled by: Henry M. Rosenstock, Keith Draxl, Bruce W. Steiner, and John T. Herron

Ionization energy determinations

IE (eV) Method Reference
9.3EIRinke and Schafer, 1967

References

Rinke and Schafer, 1967
Rinke, K.; Schafer, H., Detection of the molecules W2Cl6 and W3Cl9 in the gaseous state, Angew. Chem. Intern. Ed., 1967, 6, 637. [all data]