7-Tetradecanol, TMS derivative

Van Den Dool and Kratz RI, non-polar column, custom temperature program

View large format table.

Column type Active phase I Reference Comment
CapillaryMethyl Silicone1770.Peng, Yang, et al., 1991Program: not specified

Van Den Dool and Kratz RI, polar column, temperature ramp

View large format table.

Column type Active phase I Reference Comment
PackedCarbowax 20M1759.Peng, Yang, et al., 1991Supelcoport, 40. C @ 4. min, 8. K/min; Column length: 3.05 m; Tend: 200. C

References

Peng, Yang, et al., 1991
Peng, C.T.; Yang, Z.C.; Maltby, D., Prediction of retention indexes. III. Silylated derivatives of polar compounds, J. Chromatogr., 1991, 586, 1, 113-129, https://doi.org/10.1016/0021-9673(91)80029-G . [all data]