bis(chloroethylene)-2,4-pentanedionatorhodium complex

Phase change data

Data compiled by: William E. Acree, Jr., James S. Chickos

Enthalpy of sublimation

ΔsubH (kJ/mol) Temperature (K) Method Reference Comment
117.2 ± 7.1281.MEJesse, Ernsting, et al., 1978Based on data from 275. - 288. K. See also Stephenson and Malanowski, 1987.

References

Jesse, Ernsting, et al., 1978
Jesse, A.C.; Ernsting, J.M.; Stufkens, D.J.; Vrieze, K., Vapour pressure measurements on (acac)M(substituted olefin)2 and (acac)M(CO)2 (M = Rh(I), Ir(I)), Thermochimica Acta, 1978, 25, 1, 69-75, https://doi.org/10.1016/0040-6031(78)80041-0 . [all data]

Stephenson and Malanowski, 1987
Stephenson, Richard M.; Malanowski, Stanislaw, Handbook of the Thermodynamics of Organic Compounds, 1987, https://doi.org/10.1007/978-94-009-3173-2 . [all data]