1H-Naphtho[2,1-b]pyran, 3-ethenyldodecahydro-3,4a,7,7,10a-pentamethyl-, [3S-(3α,4aα,6aβ,10aα,10bβ)]-

Normal alkane RI, non-polar column, custom temperature program

Data compiled by: NIST Mass Spectrometry Data Center, William E. Wallace, director

Column type CapillaryCapillaryCapillaryCapillaryCapillary
Active phase HP-5SLB-5 MSHP-5CP Sil 8 CBDB-5
Column length (m) 30.30.30.50.30.
Carrier gas HeliumHeliumHeliumHeHe
Substrate
Column diameter (mm) 0.250.250.250.320.25
Phase thickness (μm) 0.250.250.250.250.25
Program not specifiednot specified130 0C 5 0C/min -> 240 0C 15 0C/min -> 320 0C (10 min)50C(5min) => 2C/min => 90C => 15C/min => 240C(4min)40C(1min) => 9C/min => 130C => 2C/min => 230C
I 2010.2017.2012.2017.2005.
ReferenceIsidorov, Lech, et al., 2008Lo Presti, Sciarrone, et al., 2008Vichi, Aumatell, et al., 2008Butkienë, Nivinskienë, et al., 2005Hamm, Bleton, et al., 2004
Comment MSDC-RI MSDC-RI MSDC-RI MSDC-RI MSDC-RI
Column type Capillary
Active phase CP Sil 5 CB
Column length (m) 25.
Carrier gas He
Substrate
Column diameter (mm)
Phase thickness (μm) 0.39
Program not specified
I 2006.
ReferenceWeyerstahl, Marschall, et al., 1998
Comment MSDC-RI

Van Den Dool and Kratz RI, polar column, temperature ramp

Data compiled by: NIST Mass Spectrometry Data Center, William E. Wallace, director

Column type CapillaryCapillary
Active phase BP-20BP-20
Column length (m) 50.50.
Carrier gas  He
Substrate
Column diameter (mm) 0.220.22
Phase thickness (μm) 0.250.25
Tstart (C) 60.60.
Tend (C) 220.220.
Heat rate (K/min) 2.2.
Initial hold (min)
Final hold (min) 20.20.
I 2365.2352.
ReferenceGonny, Bradesi, et al., 2004Rezzi, Bighelli, et al., 2001
Comment MSDC-RI MSDC-RI

Kovats' RI, non-polar column, isothermal

Data compiled by: NIST Mass Spectrometry Data Center, William E. Wallace, director

Column type PackedPacked
Active phase OV-101OV-101
Column length (m) 2.52.5
Carrier gas
Substrate Chromaton N-AW-DMCSChromaton N-AW-DMCS
Column diameter (mm)
Phase thickness (μm)
Temperature (C) 200.210.
I 2029.2050.
ReferenceKosyukova and Khorguani, 1989Kosyukova and Khorguani, 1989
Comment MSDC-RI MSDC-RI

References

Isidorov, Lech, et al., 2008
Isidorov, V.A.; Lech, P.; Zolciak, A.; Rusak, N.; Szczepaniak, L., Gas Chromatographic - nass spectrometric investigation of metabolites from the needles and roots of pine seedlings at early stages of pathogenic fungi Armillaria ostoyae attack, Trees, 2008, 22, 4, 531-542, https://doi.org/10.1007/s00468-008-0213-z . [all data]

Lo Presti, Sciarrone, et al., 2008
Lo Presti, M.; Sciarrone, D.; Crupi, M.C.; Costa, R.; Ragusa, S.; Dugo, G.; Mondello, L., Evaliation of the volatile and chiral composition in Pistacia lentiscus L. essential oil, Flavour Fragr. J., 2008, 23, 4, 249-257, https://doi.org/10.1002/ffj.1878 . [all data]

Vichi, Aumatell, et al., 2008
Vichi, S.; Aumatell, M.R.; Buxaderas, S.; Lopez-Tamames, E., Assessment of some diterpenoids in commercial distilled gin, Anal. Chim. Acta, 2008, 628, 2, 222-229, https://doi.org/10.1016/j.aca.2008.09.005 . [all data]

Butkienë, Nivinskienë, et al., 2005
Butkienë, R.; Nivinskienë, O.; Mockutë, D., α-Pinene chemotype of leaf (needle) essential oils of Juniperus communis L. growing wild in Vilnius district, Chemija, 2005, 16, 1, 53-60. [all data]

Hamm, Bleton, et al., 2004
Hamm, S.; Bleton, J.; Tchapla, A., Headspace solid phase microextraction for screening for the presence of resins in Egyptian archaeological samples, J. Sep. Sci., 2004, 27, 3, 235-243, https://doi.org/10.1002/jssc.200301611 . [all data]

Weyerstahl, Marschall, et al., 1998
Weyerstahl, P.; Marschall, H.; Weirauch, M.; Thefeld, K.; Surburg, H., Constituents of commercial Labdanum oil, Flavour Fragr. J., 1998, 13, 5, 295-318, https://doi.org/10.1002/(SICI)1099-1026(1998090)13:5<295::AID-FFJ751>3.0.CO;2-I . [all data]