C11H20N6O5S

Reaction thermochemistry data

Data compiled by: John E. Bartmess

Individual Reactions

C11H19N6O5S + Hydrogen cation = C11H20N6O5S

By formula: C11H19N6O5S + H+ = C11H20N6O5S

Quantity Value Units Method Reference Comment
Δr1336. ± 9.6kJ/molCIDCMorishetti, Huang, et al., 2010gas phase; Acid: Cys(Gly)4NH2
Quantity Value Units Method Reference Comment
Δr1318. ± 10.kJ/molH-TSMorishetti, Huang, et al., 2010gas phase; Acid: Cys(Gly)4NH2

References

Morishetti, Huang, et al., 2010
Morishetti, K.K.; Huang, B.D.; Yates, J.M.; Ren, J.H., Gas-Phase Acidities of Cysteine-Polyglycine Peptides: The Effect of the Cysteine Position, J. Am. Soc. Mass Spectrom., 2010, 21, 4, 603-614, https://doi.org/10.1016/j.jasms.2009.12.008 . [all data]