3-Phenyl-1-propanol, acetate

Phase change data

Data compiled as indicated in comments:
TRC - Thermodynamics Research Center, NIST Boulder Laboratories, Chris Muzny director
AC - William E. Acree, Jr., James S. Chickos

Quantity Value Units Method Reference Comment
Tboil500.KN/ARajyam and Murty, 1974Uncertainty assigned by TRC = 4. K; TRC

Enthalpy of vaporization

ΔvapH (kJ/mol) Temperature (K) Method Reference Comment
74.3306.AStephenson and Malanowski, 1987Based on data from 293. - 333. K.; AC
56.8402.N/ACihova, Vojtko, et al., 1986Based on data from 392. - 516. K.; AC

In addition to the Thermodynamics Research Center (TRC) data available from this site, much more physical and chemical property data is available from the following TRC products:

Kovats' RI, non-polar column, temperature ramp

Data compiled by: NIST Mass Spectrometry Data Center, William E. Wallace, director

Column type CapillaryCapillary
Active phase Methyl SiliconeSPB-1
Column length (m) 30.30.
Carrier gas HeHe
Substrate
Column diameter (mm) 0.320.32
Phase thickness (μm) 0.250.25
Tstart (C) 60.60.
Tend (C) 225.250.
Heat rate (K/min) 2.5.
Initial hold (min) 2.2.
Final hold (min) 5.5.
I 1363.1363.
ReferenceJayaprakasha, Rao, et al., 2000Jayaprakasha, Jaganmohan Rao, et al., 1997
Comment MSDC-RI MSDC-RI

References

Rajyam and Murty, 1974
Rajyam, B.; Murty, C.R.K., Study of Dielectric Relazation & Measurement of Dipole Moments of Esters Part III. Acetates and Acetoacetates, Indian J. Pure Appl. Phys., 1974, 12, 692-6. [all data]

Stephenson and Malanowski, 1987
Stephenson, Richard M.; Malanowski, Stanislaw, Handbook of the Thermodynamics of Organic Compounds, 1987, https://doi.org/10.1007/978-94-009-3173-2 . [all data]

Cihova, Vojtko, et al., 1986
Cihova, M.; Vojtko, J.; Ilavsky, J., Petrochemia, 1986, 26, 69. [all data]