Propanoic acid, 2-phenylethyl ester

Kovats' RI, non-polar column, custom temperature program

Data compiled by: NIST Mass Spectrometry Data Center, William E. Wallace, director

Column type Capillary
Active phase HP-5
Column length (m) 30.
Carrier gas He
Substrate
Column diameter (mm) 0.25
Phase thickness (μm) 0.25
Program not specified
I 1350.
ReferenceShellie and Marriott, 2003
Comment MSDC-RI

Van Den Dool and Kratz RI, non-polar column, temperature ramp

Data compiled by: NIST Mass Spectrometry Data Center, William E. Wallace, director

Column type CapillaryCapillaryCapillaryCapillaryCapillary
Active phase SPB-5HP-5HP-5MSHP-5SE-30
Column length (m) 30.30.30.30.22.
Carrier gas HeHeHeHeN2
Substrate
Column diameter (mm) 0.250.250.250.250.30
Phase thickness (μm) 0.250.250.250.251.0
Tstart (C) 60.40.60.50.60.
Tend (C) 250.240.280.280.250.
Heat rate (K/min) 4.3.4.4.2.
Initial hold (min) 2. 5.5.
Final hold (min) 20.
I 1350.1353.1350.1349.1309.
ReferencePino, Marbot, et al., 2004Shellie and Marriott, 2003Skaltsa, Mavrommati, et al., 2001Skaltsa, Lazari, et al., 2000de Frutos, Sanz, et al., 1991
Comment MSDC-RI MSDC-RI MSDC-RI MSDC-RI MSDC-RI

Normal alkane RI, non-polar column, temperature ramp

Data compiled by: NIST Mass Spectrometry Data Center, William E. Wallace, director

Column type CapillaryCapillaryCapillary
Active phase DB-1SPB-5BP-1
Column length (m) 30.30.30.
Carrier gas HeHeN2
Substrate
Column diameter (mm)  0.320.25
Phase thickness (μm) 0.250.250.25
Tstart (C) 50.40.60.
Tend (C) 220.220.220.
Heat rate (K/min) 6.5.5.
Initial hold (min) 2.1.
Final hold (min) 20.20.
I 1325.1356.1315.
ReferenceAudino, Alzogaray, et al., 2007Ledauphin, Guichard, et al., 2003Gupta, Mallavarapu, et al., 2001
Comment MSDC-RI MSDC-RI MSDC-RI

References

Shellie and Marriott, 2003
Shellie, R.A.; Marriott, P.J., Comprehensive two-dimensional gas chromatography-mass spectrometry analysis of Pelargonium graveolens essential oil using rapid scanning quadrupole mass spectrometry, Analyst, 2003, 128, 7, 879-883, https://doi.org/10.1039/b304371a . [all data]