CAS Reg. No. 12269-52-2

Reaction thermochemistry data

Data compiled by: John E. Bartmess

Individual Reactions

(CAS Reg. No. 12269-52-2 • 4294967295sulfur) + sulfur = CAS Reg. No. 12269-52-2

By formula: (CAS Reg. No. 12269-52-2 • 4294967295S) + S = CAS Reg. No. 12269-52-2

Quantity Value Units Method Reference Comment
Δr489. ± 39.kJ/molN/APolak, Fiala, et al., 1991gas phase; ΔHf(AH) from data on HOS-
Δr485.8 ± 8.8kJ/molTherFeldman, 1970gas phase

References

Polak, Fiala, et al., 1991
Polak, M.L.; Fiala, B.L.; Lineberger, W.C.; Ervin, K.M., The Ultraviolet Photoelectron Spectrum of SO-, J. Chem. Phys., 1991, 94, 10, 6926, https://doi.org/10.1063/1.460223 . [all data]

Feldman, 1970
Feldman, D., Photoablosung von Elektronen bei einigen Stabilen Negativen Ionen, Z. Naturfor., 1970, 25A, 621. [all data]