Propanoic acid, phenylmethyl ester

Normal alkane RI, non-polar column, custom temperature program

Data compiled by: NIST Mass Spectrometry Data Center, William E. Wallace, director

Column type CapillaryCapillary
Active phase SE-30HP-5
Column length (m)  50.
Carrier gas  He
Substrate
Column diameter (mm)  0.32
Phase thickness (μm)  1.05
Program not specifiednot specified
I 1234.1266.2
ReferenceVinogradov, 2004David, Scanlan, et al., 2002
Comment MSDC-RI MSDC-RI

References

Vinogradov, 2004
Vinogradov, B.A., Production, composition, properties and application of essential oils, 2004, retrieved from http://viness.narod.ru. [all data]

David, Scanlan, et al., 2002
David, F.; Scanlan, F.; Sandra, P.; Szelewski, M., Analysis of essential oil compounds using retention time locked methods and retention time databases, 2002, retrieved from http://www.chem.agilent.com. [all data]