Gadolinium difluoride

Gas phase ion energetics data

Data compiled by: Henry M. Rosenstock, Keith Draxl, Bruce W. Steiner, and John T. Herron

Ionization energy determinations

IE (eV) Method Reference
6.5 ± 0.3EIZmbov and Margrave, 1967

References

Zmbov and Margrave, 1967
Zmbov, K.F.; Margrave, J.L., Mass spectrometric studies at high temperatures. XIII.Stabilities of samarium, europium and gadolinium mono- and difluorides, J. Inorg. Nucl. Chem., 1967, 29, 59. [all data]