Dipotassium dichloride

Gas phase ion energetics data

Data compiled as indicated in comments:
LLK - Sharon G. Lias, Rhoda D. Levin, and Sherif A. Kafafi
RDSH - Henry M. Rosenstock, Keith Draxl, Bruce W. Steiner, and John T. Herron

Ionization energy determinations

IE (eV) Method Reference Comment
9.60PEPotts and Price, 1977Vertical value; LLK
9.60PEPotts, Williams, et al., 1974Vertical value; LLK

Appearance energy determinations

Ion AE (eV) Other Products MethodReferenceComment
K2Cl+10.8ClEIItoh, Sasamoto, et al., 1981LLK
ClK2+8.5ClEIBloom and Williams, 1981LLK
K2Cl+10.4ClEIGrimley and Joyce, 1969RDSH

References

Potts and Price, 1977
Potts, A.W.; Price, W.C., Photoelectron studies of ionic materials using molecular beam techniques, Phys. Scr., 1977, 16, 191. [all data]

Potts, Williams, et al., 1974
Potts, A.W.; Williams, T.A.; Price, W.C., Photoelectron spectra and electronic structure of diatomic alkali halides, Proc. Roy. Soc. London A, 1974, 341, 147. [all data]

Itoh, Sasamoto, et al., 1981
Itoh, M.; Sasamoto, T.; Sata, T., Mass-spectrometric measurement of activities in both solid and liquid solutions of the KCl-NaCl system, Bull. Chem. Soc. Jpn., 1981, 54, 3391. [all data]

Bloom and Williams, 1981
Bloom, H.; Williams, D.J., A mass spectrometric study of the vapors above the molten salt systems LiCl-CuCl, LiBr-CuBr, and NaI-CuI, J. Chem. Phys., 1981, 75, 4636. [all data]

Grimley and Joyce, 1969
Grimley, R.T.; Joyce, T.E., A technique for the calibration of high-temperature mass spectrometers, J. Phys. Chem., 1969, 73, 3047. [all data]