Dicesium dichloride

Gas phase thermochemistry data

Quantity Value Units Method Reference Comment
Δfgas-157.70kcal/molReviewChase, 1998Data last reviewed in June, 1968
Quantity Value Units Method Reference Comment
gas,1 bar91.644cal/mol*KReviewChase, 1998Data last reviewed in June, 1968

Gas Phase Heat Capacity (Shomate Equation)

Cp° = A + B*t + C*t2 + D*t3 + E/t2
H° − H°298.15= A*t + B*t2/2 + C*t3/3 + D*t4/4 − E/t + F − H
S° = A*ln(t) + B*t + C*t2/2 + D*t3/3 − E/(2*t2) + G
    Cp = heat capacity (cal/mol*K)
    H° = standard enthalpy (kcal/mol)
    S° = standard entropy (cal/mol*K)
    t = temperature (K) / 1000.

View plot Requires a JavaScript / HTML 5 canvas capable browser.

View table.

Temperature (K) 298. - 6000.
A 19.86850
B 0.002979
C -0.000806
D 0.000069
E -0.032267
F -163.7320
G 115.5070
H -157.7000
ReferenceChase, 1998
Comment Data last reviewed in June, 1968

Gas phase ion energetics data

Data compiled as indicated in comments:
LLK - Sharon G. Lias, Rhoda D. Levin, and Sherif A. Kafafi
RDSH - Henry M. Rosenstock, Keith Draxl, Bruce W. Steiner, and John T. Herron

Ionization energy determinations

IE (eV) Method Reference Comment
9.15PEPotts and Price, 1977Vertical value; LLK
9.15PEPotts, Williams, et al., 1974Vertical value; LLK

Appearance energy determinations

Ion AE (eV) Other Products MethodReferenceComment
Cs2Cl+8.48 ± 0.05ClPIBerkowitz, 1969RDSH

References

Chase, 1998
Chase, M.W., Jr., NIST-JANAF Themochemical Tables, Fourth Edition, J. Phys. Chem. Ref. Data, Monograph 9, 1998, 1-1951. [all data]

Potts and Price, 1977
Potts, A.W.; Price, W.C., Photoelectron studies of ionic materials using molecular beam techniques, Phys. Scr., 1977, 16, 191. [all data]

Potts, Williams, et al., 1974
Potts, A.W.; Williams, T.A.; Price, W.C., Photoelectron spectra and electronic structure of diatomic alkali halides, Proc. Roy. Soc. London A, 1974, 341, 147. [all data]

Berkowitz, 1969
Berkowitz, J., Photoionization of high-temperature vapors. V. Cesium halides; chemical shift of autoionization, J. Chem. Phys., 1969, 50, 3503. [all data]