Trimethyl(4-trifluoromethylphenyl)silane

Phase change data

Data compiled by: William E. Acree, Jr., James S. Chickos

Enthalpy of vaporization

ΔvapH (kcal/mol) Temperature (K) Reference Comment
11.3 ± 0.05378.Zelenina, Chusova, et al., 2006Based on data from 296. - 460. K.

References

Zelenina, Chusova, et al., 2006
Zelenina, L.N.; Chusova, T.P.; Stenin, Yu.G.; Bakovets, V.V., The thermodynamic properties of talyl-and phenylsilanes, Russ. J. Phys. Chem., 2006, 80, 2, 139-142, https://doi.org/10.1134/S0036024406020014 . [all data]