Platinum, bis(η3-2-propenyl)-

Gas phase ion energetics data

Data compiled by: Sharon G. Lias, Rhoda D. Levin, and Sherif A. Kafafi

Ionization energy determinations

IE (eV) Method Reference Comment
7.91PEBohm, Gleiter, et al., 1980Vertical value

References

Bohm, Gleiter, et al., 1980
Bohm, M.C.; Gleiter, R.; Batich, C.D., 106. The photoelectron spectra of (Ni, Pd, Pt-Diallyl), Helv. Chim. Acta, 1980, 63, 990. [all data]