Simazine

Condensed phase thermochemistry data

Data compiled by: Hussein Y. Afeefy, Joel F. Liebman, and Stephen E. Stein

Quantity Value Units Method Reference Comment
Δfsolid-89.6 ± 4.1kJ/molCcbGromova, Lyubarskii, et al., 1984
Quantity Value Units Method Reference Comment
Δcsolid-4403.7 ± 3.5kJ/molCcbGromova, Lyubarskii, et al., 1984

Phase change data

Data compiled as indicated in comments:
TRC - Thermodynamics Research Center, NIST Boulder Laboratories, Chris Muzny director
AC - William E. Acree, Jr., James S. Chickos

Quantity Value Units Method Reference Comment
Tfus502.93KN/ADonnelly, Drewes, et al., 1990Uncertainty assigned by TRC = 0.2 K; TRC
Tfus503.8KN/APlato, 1972Uncertainty assigned by TRC = 0.2 K; TRC

Enthalpy of sublimation

ΔsubH (kJ/mol) Temperature (K) Method Reference Comment
130.8338.GS-GCStephenson and Malanowski, 1987Based on data from 323. - 403. K. See also Friedrich and Stammbach, 1964.; AC

Enthalpy of fusion

ΔfusH (kJ/mol) Temperature (K) Method Reference Comment
47.35502.5DSCDonnelly, Drewes, et al., 1990, 2AC

In addition to the Thermodynamics Research Center (TRC) data available from this site, much more physical and chemical property data is available from the following TRC products:

Normal alkane RI, non-polar column, temperature ramp

Data compiled by: NIST Mass Spectrometry Data Center, William E. Wallace, director

Column type CapillaryCapillaryCapillary
Active phase HP-5Polydimethyl siloxaneDurabond-5
Column length (m) 30.25.30.
Carrier gas  HeHelium
Substrate
Column diameter (mm) 0.320.320.25
Phase thickness (μm) 0.250.520.25
Tstart (C) 50.60.50.
Tend (C) 300.270.300.
Heat rate (K/min) 10.6.6.
Initial hold (min) 1. 4.
Final hold (min) 4.
I 1755.1749.1749.
ReferenceMurayama, Mukai, et al., 2000Hayakawa, Niinomi, et al., 1990Pereira, Rostad, et al., 1990
Comment MSDC-RI MSDC-RI MSDC-RI

Kovats' RI, non-polar column, custom temperature program

Data compiled by: NIST Mass Spectrometry Data Center, William E. Wallace, director

Column type CapillaryCapillaryPacked
Active phase HP-5DB-5MSSE-30
Column length (m) 30.30.1.5
Carrier gas   He
Substrate   Chromosorb G HP (80-100 mesh)
Column diameter (mm) 0.320.32
Phase thickness (μm) 0.250.25
Program 50C(1min) => 20C/min => 150C => 10C/min => 280C(4min)50 C(1min)->20C/min->200C->10C/min->280C (1.5min)not specified
I 1745.1748.1690.
ReferenceTanabe, Mitobe, et al., 2000Tanabe, Mitobe, et al., 1996Ramsey, Lee, et al., 1980
Comment MSDC-RI MSDC-RI MSDC-RI

Normal alkane RI, non-polar column, custom temperature program

Data compiled by: NIST Mass Spectrometry Data Center, William E. Wallace, director

Column type CapillaryCapillaryCapillaryOther
Active phase 5 % Phenyl methyl siloxane5 % Phenyl methyl siloxaneHP-5Methyl Silicone
Column length (m) 30.30.30.
Carrier gas HeliumHelium
Substrate
Column diameter (mm) 0.250.250.25
Phase thickness (μm) 0.250.250.25
Program 50 0C(1 min) 25 0C/min -> 125 0C 10 0C/min -> 300 0C (10 min)50 0C(1 min) 25 0C/min -> 125 0C 10 0C/min -> 300 0C (10 min)50 0C (1 min) 20 0C/min -> 150 0C 10 0C/min -> 280 0Cnot specified
I 1744.1748.1745.1690.
ReferenceDepartment of Food Safety and Welfare, 2006Department of Food Safety and Welfare, 2006Kawara, Asada, et al., 2005Ardrey and Moffat, 1981
Comment MSDC-RI MSDC-RI MSDC-RI MSDC-RI

Lee's RI, non-polar column, temperature ramp

Data compiled by: NIST Mass Spectrometry Data Center, William E. Wallace, director

Column type Capillary
Active phase Durabond-5
Column length (m) 30.
Carrier gas Helium
Substrate
Column diameter (mm) 0.25
Phase thickness (μm) 0.25
Tstart (C) 50.
Tend (C) 300.
Heat rate (K/min) 6.
Initial hold (min) 4.
Final hold (min)
I 293.57
ReferencePereira, Rostad, et al., 1990
Comment MSDC-RI

References

Gromova, Lyubarskii, et al., 1984
Gromova, T.I.; Lyubarskii, M.V.; Sukhanova, T.G., Heats of combustion and formation of derivatives of symmetrical triazine, Russ. J. Phys. Chem. (Engl. Transl.), 1984, 58, 949-950. [all data]

Donnelly, Drewes, et al., 1990
Donnelly, J.R.; Drewes, L.A.; Johnson, R.L.; Munslow, W.D.; Knapp, K.K.; Sovocool, G.W., Purity and heat of fusion data for environmental standards as determined by differential scanning calorimetry, Thermochim. Acta, 1990, 167, 2, 155, https://doi.org/10.1016/0040-6031(90)80476-F . [all data]

Plato, 1972
Plato, C., DSC as a general method for determining purity and heat of fusion of high-purity organic chemicals, Anal. Chem., 1972, 44, 1531. [all data]

Stephenson and Malanowski, 1987
Stephenson, Richard M.; Malanowski, Stanislaw, Handbook of the Thermodynamics of Organic Compounds, 1987, https://doi.org/10.1007/978-94-009-3173-2 . [all data]

Friedrich and Stammbach, 1964
Friedrich, K.; Stammbach, K., Gas chromatographic determination of small vapour pressures determination of the vapour pressures of some triazine herbicides, Journal of Chromatography A, 1964, 16, 22-28, https://doi.org/10.1016/S0021-9673(01)82436-5 . [all data]

Donnelly, Drewes, et al., 1990, 2
Donnelly, J.R.; Drewes, L.A.; Johnson, R.L.; Munslow, W.D.; Knapp, K.K.; Sovocool, G.W., Purity and heat of fusion data for environmental standards as determined by differential scanning calorimetry, Thermochimica Acta, 1990, 167, 2, 155-187, https://doi.org/10.1016/0040-6031(90)80476-F . [all data]