Diberyllium tetrachloride

Gas phase thermochemistry data

Quantity Value Units Method Reference Comment
Δfgas-179.00kcal/molReviewChase, 1998Data last reviewed in June, 1965
Quantity Value Units Method Reference Comment
gas,1 bar91.150cal/mol*KReviewChase, 1998Data last reviewed in June, 1965

Gas Phase Heat Capacity (Shomate Equation)

Cp° = A + B*t + C*t2 + D*t3 + E/t2
H° − H°298.15= A*t + B*t2/2 + C*t3/3 + D*t4/4 − E/t + F − H
S° = A*ln(t) + B*t + C*t2/2 + D*t3/3 − E/(2*t2) + G
    Cp = heat capacity (cal/mol*K)
    H° = standard enthalpy (kcal/mol)
    S° = standard entropy (cal/mol*K)
    t = temperature (K) / 1000.

View plot Requires a JavaScript / HTML 5 canvas capable browser.

View table.

Temperature (K) 298. - 6000.
A 31.04981
B 0.626848
C -0.168461
D 0.014302
E -0.333938
F -189.4040
G 126.6680
H -179.0000
ReferenceChase, 1998
Comment Data last reviewed in June, 1965

References

Chase, 1998
Chase, M.W., Jr., NIST-JANAF Themochemical Tables, Fourth Edition, J. Phys. Chem. Ref. Data, Monograph 9, 1998, 1-1951. [all data]