OPb(O2)

Vibrational and/or electronic energy levels

Data compiled by: Marilyn E. Jacox

State:   X

Vib.
sym.
 No.   Approximate
 type of mode
 cm-1   Med.   Method   References

702.6 Ar IR Chertihin and Andrews, 1996
531.3 Ar IR Chertihin and Andrews, 1996

Additional references: Jacox, 1998, page 253

References

Chertihin and Andrews, 1996
Chertihin, G.V.; Andrews, L., Infrared spectra of the reaction products of laser ablated lead atoms and oxygen molecules in condensing argon and nitrogen, J. Chem. Phys., 1996, 105, 7, 2561, https://doi.org/10.1063/1.472122 . [all data]

Jacox, 1998
Jacox, M.E., Vibrational and electronic energy levels of polyatomic transient molecules: supplement A, J. Phys. Chem. Ref. Data, 1998, 27, 2, 115-393, https://doi.org/10.1063/1.556017 . [all data]