Urea, N,N-dibutyl-N'-(4-nitrophenyl)-

Reaction thermochemistry data

Data compiled by: Hussein Y. Afeefy, Joel F. Liebman, and Stephen E. Stein

Individual Reactions

Benzene, 1-isocyanato-4-nitro- + 1-Butanamine, N-butyl- = C15H23N3O3

By formula: C7H4N2O3 + C8H19N = C15H23N3O3

Quantity Value Units Method Reference Comment
Δr-113.6 ± 0.7kJ/molCmKiselev, Malkov, et al., 1989liquid phase; solvent: Dioxane; #TDE

References

Kiselev, Malkov, et al., 1989
Kiselev, V.D.; Malkov, V.B.; Murzin, D.G.; Shakirov, I.M.; Konovalov, A.I., Thermochemical study of the reaction of isocyanate with amines, Dokl. Phys. Chem. (Engl. Transl.), 1989, 308, 711-713, In original 111. [all data]