Iron, tricarbonylchloro(η3-2-propenyl)-

Gas phase ion energetics data

Data compiled by: Sharon G. Lias, John E. Bartmess, Joel F. Liebman, John L. Holmes, Rhoda D. Levin, and W. Gary Mallard

Ionization energy determinations

IE (eV) Method Reference Comment
8.3PELouwen, Hart, et al., 1982
8.96PELouwen, Hart, et al., 1982Vertical value

References

Louwen, Hart, et al., 1982
Louwen, J.N.; Hart, J.; Stufkens, D.J.; Oskam, A., The HeI and HeII photoelectron spectra of [Fe η3-C3H5(CO)3X] and [Fe η3-C4H7(CO)3X] (X = Cl, Br, I) and [CoC3H5(CO)3], Z. Naturforsch. B:, 1982, 37, 179. [all data]