Phosphorus, mol. (P4)

Gas phase thermochemistry data

Quantity Value Units Method Reference Comment
Δfgas14.1 ± 0.07kcal/molReviewCox, Wagman, et al., 1984CODATA Review value
Δfgas14.08kcal/molReviewChase, 1998Data last reviewed in June, 1961
Quantity Value Units Method Reference Comment
gas,1 bar66.92 ± 0.12cal/mol*KReviewCox, Wagman, et al., 1984CODATA Review value
gas,1 bar66.905cal/mol*KReviewChase, 1998Data last reviewed in June, 1961

Gas Phase Heat Capacity (Shomate Equation)

Cp° = A + B*t + C*t2 + D*t3 + E/t2
H° − H°298.15= A*t + B*t2/2 + C*t3/3 + D*t4/4 − E/t + F − H
S° = A*ln(t) + B*t + C*t2/2 + D*t3/3 − E/(2*t2) + G
    Cp = heat capacity (cal/mol*K)
    H° = standard enthalpy (kcal/mol)
    S° = standard entropy (cal/mol*K)
    t = temperature (K) / 1000.

View plot Requires a JavaScript / HTML 5 canvas capable browser.

View table.

Temperature (K) 298. - 6000.
A 19.45140
B 0.358146
C -0.096935
D 0.008266
E -0.317239
F 7.200792
G 88.55681
H 14.07910
ReferenceChase, 1998
Comment Data last reviewed in June, 1961

References

Cox, Wagman, et al., 1984
Cox, J.D.; Wagman, D.D.; Medvedev, V.A., CODATA Key Values for Thermodynamics, Hemisphere Publishing Corp., New York, 1984, 1. [all data]

Chase, 1998
Chase, M.W., Jr., NIST-JANAF Themochemical Tables, Fourth Edition, J. Phys. Chem. Ref. Data, Monograph 9, 1998, 1-1951. [all data]