Hydrogen anion

Gas phase thermochemistry data

Quantity Value Units Method Reference Comment
gas,1 bar143.75J/mol*KReviewChase, 1998Data last reviewed in September, 1977

References

Chase, 1998
Chase, M.W., Jr., NIST-JANAF Themochemical Tables, Fourth Edition, J. Phys. Chem. Ref. Data, Monograph 9, 1998, 1-1951. [all data]