Chromium dimer

Gas phase ion energetics data

Data compiled as indicated in comments:
LBLHLM - Sharon G. Lias, John E. Bartmess, Joel F. Liebman, John L. Holmes, Rhoda D. Levin, and W. Gary Mallard
B - John E. Bartmess

Electron affinity determinations

EA (eV) Method Reference Comment
0.5050 ± 0.0050LPESCasey, Villata, et al., 1991See also Casey and Leopold, 1993 for more analysis.; B

Ionization energy determinations

IE (eV) Method Reference Comment
6.4 ± 0.2EIHilpert and Ruthardt, 1987LBLHLM

References

Casey, Villata, et al., 1991
Casey, S.M.; Villata, P.W.; Bengali, A.A.; Cheng, C.-L.; Dick, J.P.; Fenn, P.T.; Leopold, D.G., A Study of Cr2 by Negative ion Photoelectron Spectroscopy, J. Am. Chem. Soc., 1991, 113, 17, 6688, https://doi.org/10.1021/ja00017a058 . [all data]

Casey and Leopold, 1993
Casey, S.M.; Leopold, D.G., Negative Ion Photoelectron Spectroscopy of Cr2, J. Phys. Chem., 1993, 97, 4, 816, https://doi.org/10.1021/j100106a005 . [all data]

Hilpert and Ruthardt, 1987
Hilpert, K.; Ruthardt, K., Determination of the dissociation energy of the Cr2 molecule, Ber. Bunsen-Ges. Phys. Chem., 1987, 91, 724. [all data]