Cobalt, [(1,2,5,6-η)-1,5-cyclooctadiene](η5-2,4-cyclopentadien-1-yl)-

Gas phase ion energetics data

Data compiled by: Sharon G. Lias, John E. Bartmess, Joel F. Liebman, John L. Holmes, Rhoda D. Levin, and W. Gary Mallard

Ionization energy determinations

IE (eV) Method Reference Comment
6.5PEWakatuski, Yamazaki, et al., 1987
6.4PEGreen, Powell, et al., 1984
6.86PEWakatuski, Yamazaki, et al., 1987Vertical value
6.96PEGreen, Powell, et al., 1984Vertical value

References

Wakatuski, Yamazaki, et al., 1987
Wakatuski, Y.; Yamazaki, H.; Kobayashi, T.; Sugawara, Y., Effect of electron-withdrawing substituents on the cobalt(I)-coordinated cycylopentadienyl ring. Spectra and diene substitution kinetics of [Co(C5H4X)(1,5-cyclooctadiene)], Organometallics, 1987, 6, 1191. [all data]

Green, Powell, et al., 1984
Green, J.C.; Powell, P.; van Tilborg, J.E., He I and He II photoelectron spectroscopic studies of the bonding in cobalt, rhodium, and iridium cyclopentadienyl diene complexes, Organometallics, 1984, 3, 211. [all data]

Rosenblum, et al., 1972
Rosenblum, M., et al., J. Am. Chem. Soc., 1972, 94, 1239. [all data]