Dysprosium dicarbide

Gas phase ion energetics data

Data compiled by: Henry M. Rosenstock, Keith Draxl, Bruce W. Steiner, and John T. Herron

Ionization energy determinations

IE (eV) Method Reference
8.3 ± 0.5EIBalducci, Capalbi, et al., 1969

References

Balducci, Capalbi, et al., 1969
Balducci, G.; Capalbi, A.; DeMaria, G.; Guido, M., Thermodynamics of rare-earth-carbon systems. II.The holmium-carbon and dysprosium-carbon systems, J. Chem. Phys., 1969, 51, 2871. [all data]