Benzenamine, N,N,3-trimethyl-

Gas phase thermochemistry data

Data compiled by: Hussein Y. Afeefy, Joel F. Liebman, and Stephen E. Stein

Quantity Value Units Method Reference Comment
Δfgas72.6 ± 7.3kJ/molCcbRiberio da Silva, Riberio da Silva, et al., 1996

Condensed phase thermochemistry data

Data compiled by: Hussein Y. Afeefy, Joel F. Liebman, and Stephen E. Stein

Quantity Value Units Method Reference Comment
Δfliquid14.4 ± 2.5kJ/molCcbRiberio da Silva, Riberio da Silva, et al., 1996
Quantity Value Units Method Reference Comment
Δcliquid-5413.9 ± 2.2kJ/molCcbRiberio da Silva, Riberio da Silva, et al., 1996

Phase change data

Data compiled as indicated in comments:
BS - Robert L. Brown and Stephen E. Stein
ALS - Hussein Y. Afeefy, Joel F. Liebman, and Stephen E. Stein
DRB - Donald R. Burgess, Jr.
AC - William E. Acree, Jr., James S. Chickos

Quantity Value Units Method Reference Comment
Tboil488.2KN/AAldrich Chemical Company Inc., 1990BS
Tboil485.2KN/AWeast and Grasselli, 1989BS
Tboil485. - 488.KN/AFrinton Laboratories Inc., 1986BS
Quantity Value Units Method Reference Comment
Δvap58.2 ± 6.9kJ/molVRiberio da Silva, Riberio da Silva, et al., 1996ALS
Δvap58.2kJ/molN/ARiberio da Silva, Riberio da Silva, et al., 1996DRB
Δvap58.2 ± 6.9kJ/molCGCRiberio da Silva, Riberio da Silva, et al., 1996AC

Reaction thermochemistry data

Data compiled by: John E. Bartmess

Individual Reactions

C9H12N- + Hydrogen cation = Benzenamine, N,N,3-trimethyl-

By formula: C9H12N- + H+ = C9H13N

Quantity Value Units Method Reference Comment
Δr1597. ± 21.kJ/molG+TSCaldwell and Bartmessgas phase
Quantity Value Units Method Reference Comment
Δr1569. ± 21.kJ/molIMRBCaldwell and Bartmessgas phase

Gas phase ion energetics data

Data evaluated as indicated in comments:
HL - Edward P. Hunter and Sharon G. Lias

Data compiled as indicated in comments:
B - John E. Bartmess
LBLHLM - Sharon G. Lias, John E. Bartmess, Joel F. Liebman, John L. Holmes, Rhoda D. Levin, and W. Gary Mallard
LLK - Sharon G. Lias, Rhoda D. Levin, and Sherif A. Kafafi
RDSH - Henry M. Rosenstock, Keith Draxl, Bruce W. Steiner, and John T. Herron

Quantity Value Units Method Reference Comment
Proton affinity (review)942.1kJ/molN/AHunter and Lias, 1998HL
Quantity Value Units Method Reference Comment
Gas basicity915.7kJ/molN/AHunter and Lias, 1998HL

Ionization energy determinations

IE (eV) Method Reference Comment
7.02EQLias, Jackson, et al., 1985LBLHLM
7.06PECowling and Johnstone, 1973LLK
7.35CTSFarrell and Newton, 1965RDSH
7.24PEKobayashi and Nagakura, 1974Vertical value; LLK
7.24PEKobayashi and Nagakura, 1972Vertical value; LLK
7.27PEKobayashi and Nagakura, 1972Vertical value; LLK

De-protonation reactions

C9H12N- + Hydrogen cation = Benzenamine, N,N,3-trimethyl-

By formula: C9H12N- + H+ = C9H13N

Quantity Value Units Method Reference Comment
Δr1597. ± 21.kJ/molG+TSCaldwell and Bartmessgas phase; B
Quantity Value Units Method Reference Comment
Δr1569. ± 21.kJ/molIMRBCaldwell and Bartmessgas phase; B

Kovats' RI, polar column, isothermal

View large format table.

Column type Active phase Temperature (C) I Reference Comment
PackedCarbowax 20M150.1653.2Ellis and Still, 1979Chromosorb W, AW-DMCS
PackedCarbowax 20M150.1653.6Ellis and Still, 1979Chromosorb W, AW-DMCS

Van Den Dool and Kratz RI, non-polar column, temperature ramp

View large format table.

Column type Active phase I Reference Comment
CapillaryOV-11164.6Gautzsch and Zinn, 19968. K/min; Tstart: 35. C; Tend: 300. C

Normal alkane RI, non-polar column, temperature ramp

View large format table.

Column type Active phase I Reference Comment
CapillarySPB-11174.Thomas and Bassols, 19925. K/min; Column length: 60. m; Tstart: 80. C; Tend: 230. C

Normal alkane RI, polar column, temperature ramp

View large format table.

Column type Active phase I Reference Comment
CapillarySupelcowax1664.Thomas and Bassols, 19925. K/min; Column length: 60. m; Tstart: 80. C; Tend: 230. C

References

Riberio da Silva, Riberio da Silva, et al., 1996
Riberio da Silva, M.A.V.; Riberio da Silva, M.D.M.C.; Monteiro, M.F.B.M.; Gomes, M.L.A.C.N.; Chickos, J.S.; Smith, A.P.; Liebman, J.F., Thermochemical studies for determination of the molar enthalpy of formation of aniline derivatives, Struct. Chem., 1996, 7, 367-373. [all data]

Aldrich Chemical Company Inc., 1990
Aldrich Chemical Company Inc., Catalog Handbook of Fine Chemicals, Aldrich Chemical Company, Inc., Milwaukee WI, 1990, 1. [all data]

Weast and Grasselli, 1989
CRC Handbook of Data on Organic Compounds, 2nd Editon, Weast,R.C and Grasselli, J.G., ed(s)., CRC Press, Inc., Boca Raton, FL, 1989, 1. [all data]

Frinton Laboratories Inc., 1986
Frinton Laboratories Inc., Catalog Number 11, Frinton Laboratories Inc., Vineland, NJ, 1986, 99. [all data]

Caldwell and Bartmess
Caldwell, G.; Bartmess, J.E., , Unpublished results. [all data]

Hunter and Lias, 1998
Hunter, E.P.; Lias, S.G., Evaluated Gas Phase Basicities and Proton Affinities of Molecules: An Update, J. Phys. Chem. Ref. Data, 1998, 27, 3, 413-656, https://doi.org/10.1063/1.556018 . [all data]

Lias, Jackson, et al., 1985
Lias, S.G.; Jackson, J.-A.A.; Argentar, H.; Liebman, J.F., Substituted N,N-dialkylanilines: Relative ionization energies and proton affinities through determinations of ion-molecule reaction equilibrium constants, J. Org. Chem., 1985, 50, 333. [all data]

Cowling and Johnstone, 1973
Cowling, S.A.; Johnstone, R.A.W., Photoelectron spectroscopy: The effects of steric inhibition to resonance in anilines, J. Electron Spectrosc. Relat. Phenom., 1973, 2, 161. [all data]

Farrell and Newton, 1965
Farrell, P.G.; Newton, J., Ionization potentials of aromatic amines, J. Phys. Chem., 1965, 69, 3506. [all data]

Kobayashi and Nagakura, 1974
Kobayashi, T.; Nagakura, S., Photoelectron spectra of substituted benzenes, Bull. Chem. Soc. Jpn., 1974, 47, 2563. [all data]

Kobayashi and Nagakura, 1972
Kobayashi, T.; Nagakura, S., Photoelectron spectra of anilines, Chem. Lett., 1972, 1013. [all data]