V14O radical

Gas phase ion energetics data

Data compiled by: John E. Bartmess

Electron affinity determinations

EA (eV) Method Reference Comment
1.56 ± 0.16LPESPramann, Koyasu, et al., 2002Vertical Detachment Energy: 1.96±0.05 eV

References

Pramann, Koyasu, et al., 2002
Pramann, A.; Koyasu, K.; Nakajima, A.; Kaya, K., Anion photoelectron spectroscopy of VnOm- (n=4-15; m=0-2), J. Chem. Phys., 2002, 116, 15, 6521-6528, https://doi.org/10.1063/1.1461824 . [all data]