vanadium sulphide

Gas phase ion energetics data

Data compiled as indicated in comments:
LBLHLM - Sharon G. Lias, John E. Bartmess, Joel F. Liebman, John L. Holmes, Rhoda D. Levin, and W. Gary Mallard
LLK - Sharon G. Lias, Rhoda D. Levin, and Sherif A. Kafafi

Ionization energy determinations

IE (eV) Method Reference Comment
8.4 ± 0.3EIBotor and Edwards, 1984LBLHLM
~9.EIOwzarski and Franzen, 1974LLK

References

Botor and Edwards, 1984
Botor, J.P.; Edwards, J.G., Thermodynamics of VS(s) and its equilibrium vapor by Knudsen-cell mass spectrometry, J. Chem. Phys., 1984, 81, 2185. [all data]

Owzarski and Franzen, 1974
Owzarski, T.P.; Franzen, H.F., High temperature mass spectrometry, vaporization, and thermodynamics of vanadium monosulfide, J. Chem. Phys., 1974, 60, 1113. [all data]