Tritungsten nonaoxide

Gas phase thermochemistry data

Quantity Value Units Method Reference Comment
Δfgas-2023.38kJ/molReviewChase, 1998Data last reviewed in September, 1966
Quantity Value Units Method Reference Comment
gas,1 bar504.32J/mol*KReviewChase, 1998Data last reviewed in September, 1966

Gas Phase Heat Capacity (Shomate Equation)

Cp° = A + B*t + C*t2 + D*t3 + E/t2
H° − H°298.15= A*t + B*t2/2 + C*t3/3 + D*t4/4 − E/t + F − H
S° = A*ln(t) + B*t + C*t2/2 + D*t3/3 − E/(2*t2) + G
    Cp = heat capacity (J/mol*K)
    H° = standard enthalpy (kJ/mol)
    S° = standard entropy (J/mol*K)
    t = temperature (K) / 1000.

View plot Requires a JavaScript / HTML 5 canvas capable browser.

View table.

Temperature (K) 298. - 6000.
A 271.6270
B 9.308563
C -2.502209
D 0.212463
E -4.698548
F -2120.514
G 803.9347
H -2023.382
ReferenceChase, 1998
Comment Data last reviewed in September, 1966

Gas phase ion energetics data

Data compiled as indicated in comments:
LLK - Sharon G. Lias, Rhoda D. Levin, and Sherif A. Kafafi
RDSH - Henry M. Rosenstock, Keith Draxl, Bruce W. Steiner, and John T. Herron

Ionization energy determinations

IE (eV) Method Reference Comment
12.0 ± 0.2EIBennett, Lin, et al., 1974LLK
13.3EINorman and Staley, 1965RDSH

Appearance energy determinations

Ion AE (eV) Other Products MethodReferenceComment
O8W3+14.6 ± 0.2OEIBennett, Lin, et al., 1974LLK
W3O8+15.5OEINorman and Staley, 1965RDSH

References

Chase, 1998
Chase, M.W., Jr., NIST-JANAF Themochemical Tables, Fourth Edition, J. Phys. Chem. Ref. Data, Monograph 9, 1998, 1-1951. [all data]

Bennett, Lin, et al., 1974
Bennett, S.L.; Lin, S.-S.; Gilles, P.W., High-temperature vaporization of ternary systems. I. Mass spectrometry of oxygen-rich vanadium-tungsten-oxygen species, J. Phys. Chem., 1974, 78, 266. [all data]

Norman and Staley, 1965
Norman, J.H.; Staley, H.G., Thermodynamics of the dimerization and trimerization of gaseous tungsten trioxide and molybdenum trioxide, J. Chem. Phys., 1965, 43, 3804. [all data]