5-(β-Bromoallyl)-5-(1-methylbutyl)barbituric acid

Kovats' RI, non-polar column, isothermal

View large format table.

Column type Active phase Temperature (C) I Reference Comment
PackedSE-30200.2031.Stead, Gill, et al., 1982

References

Stead, Gill, et al., 1982
Stead, A.H.; Gill, R.; Evans, A.T.; Moffat, A.C., Predictions of gas chromatographic retention characteristics of barbiturates from molecular structure, J. Chromatogr., 1982, 234, 2, 277-283, https://doi.org/10.1016/S0021-9673(00)81866-X . [all data]