HSCC

Vibrational and/or electronic energy levels

Data compiled by: Marilyn E. Jacox

State:   ?

 Energy
 (cm-1
 Med.   Transition   λmin
 (nm)
 λmax
 (nm)

References

To = 27475.5 gas 330 380 Krishnamachari and Venkatasubramanian, 1986

State:   A?

Vib.
sym.
 No.   Approximate
 type of mode
 cm-1   Med.   Method   References

HSC bend 1062 gas AB Krishnamachari and Venkatasubramanian, 1986
C-S stretch 746 gas AB Krishnamachari and Venkatasubramanian, 1986
290 gas AB Krishnamachari and Venkatasubramanian, 1986

State:   X

Vib.
sym.
 No.   Approximate
 type of mode
 cm-1   Med.   Method   References

373 gas AB Krishnamachari and Venkatasubramanian, 1986

Additional references: Jacox, 1994, page 157

Krishnamachari and Venkatasubramanian, 1986
Krishnamachari, S.L.N.G.; Venkatasubramanian, R., Indian J. Phys., 1986, 60B, 37. [all data]

Jacox, 1994
Jacox, M.E., Vibrational and electronic energy levels of polyatomic transient molecules, American Chemical Society, Washington, DC, 1994, 464. [all data]