Dimolybdenum pentaoxide

Gas phase ion energetics data

Data compiled by: Henry M. Rosenstock, Keith Draxl, Bruce W. Steiner, and John T. Herron

Ionization energy determinations

IE (eV) Method Reference
10.EIBurns, DeMaria, et al., 1960

References

Burns, DeMaria, et al., 1960
Burns, R.P.; DeMaria, G.; Drowart, J.; Grimley, R.T., Mass spectrometric investigation of the sublimation of molybdenum dioxide, J. Chem. Phys., 1960, 32, 1363. [all data]