Iron,tricarbonyl[(1,2,3,4-η4)-1,3-cyclohexadiene]-

Gas phase ion energetics data

Data compiled as indicated in comments:
LLK - Sharon G. Lias, Rhoda D. Levin, and Sherif A. Kafafi
RDSH - Henry M. Rosenstock, Keith Draxl, Bruce W. Steiner, and John T. Herron

Ionization energy determinations

IE (eV) Method Reference Comment
8.0 ± 0.2EIWinters and Kiser, 1965RDSH
7.96PEWorley, Webb, et al., 1980Vertical value; LLK
7.98PEGreen, Powell, et al., 1976Vertical value; LLK

References

Winters and Kiser, 1965
Winters, R.E.; Kiser, R.W., Ionization potentials and mass spectra of cyclopentadienylmolybdenum dicarbonyl nitrosyl and 1,3-cyclohexadieneiron tricarbonyl, J. Phys. Chem., 1965, 69, 3198. [all data]

Worley, Webb, et al., 1980
Worley, S.D.; Webb, T.R.; Gibson, D.H.; Ong, T.-S., The photoelectron spectra of some iron tricarbonyl complexes of 4π-electron donor ligands, J. Electron Spectrosc. Relat. Phenom., 1980, 18, 189. [all data]

Green, Powell, et al., 1976
Green, J.C.; Powell, P.; Van Tilborg, J., He(I) photoelectron spectra of tricarbonyl-iron and -ruthenium complexes of cyclic dienes, and of tricarbonylcycloheptatriene- and tricarbonylcyclooctatetraene-iron, J. Chem. Soc. Dalton Trans., 1976, 1974. [all data]