Nickel,bis((1,2,3-η3)-(1-methyl-2-propenyl))-

Gas phase ion energetics data

Data compiled by: Sharon G. Lias, Rhoda D. Levin, and Sherif A. Kafafi

Ionization energy determinations

IE (eV) Method Reference Comment
7.53PEBatich, 1976Vertical value

References

Batich, 1976
Batich, C., Photoelectron spectroscopy of bis(π-allyl) nickel and its methyl substituted derivatives: support for the near validity of Koopmans' Theorem, J. Am. Chem. Soc., 1976, 98, 7585. [all data]