Disiladicarbide

Gas phase ion energetics data

Data compiled as indicated in comments:
RDSH - Henry M. Rosenstock, Keith Draxl, Bruce W. Steiner, and John T. Herron
B - John E. Bartmess

Electron affinity determinations

EA (eV) Method Reference Comment
1.610 ± 0.010LPESNakajima, Taguwa, et al., 1995Vertical Detachment Energy: 1.93±0.08 eV; B

Ionization energy determinations

IE (eV) Method Reference Comment
8.2 ± 0.3EIDrowart, DeMaria, et al., 1958RDSH

References

Nakajima, Taguwa, et al., 1995
Nakajima, A.; Taguwa, T.; Nakao, K.; Gomei, M.; Kishi, R.; Iwata, S.; Kaya, K., Photoelectron Spectroscopy of silicon-carbon cluster Anions (SinCm-), J. Chem. Phys., 1995, 103, 6, 2050, https://doi.org/10.1063/1.469731 . [all data]

Drowart, DeMaria, et al., 1958
Drowart, J.; DeMaria, G.; Inghram, M.G., Thermodynamic study of SiC utilizing a mass spectrometer, J. Chem. Phys., 1958, 29, 1015. [all data]