Carbon monoxide, ion(1+)

Ion clustering data

Data compiled by: Michael M. Meot-Ner (Mautner) and Sharon G. Lias

Clustering reactions

CO+ + Argon = (CO+ • Argon)

By formula: CO+ + Ar = (CO+ • Ar)

Quantity Value Units Method Reference Comment
Δr67.4 ± 5.9kJ/molPIPECONorwood, Guo, et al., 1989gas phase; CO+(X) ground state

CO+ + Carbon monoxide = (CO+ • Carbon monoxide)

By formula: CO+ + CO = (CO+ • CO)

Quantity Value Units Method Reference Comment
Δr67.kJ/molPIPECONorwood, Guo, et al., 1988gas phase; CO+ in state B, ΔrH>
Δr93.7kJ/molPILinn, Ono, et al., 1981gas phase
Δr120. ± 30.kJ/molEIMunson and Franlin, 1962gas phase; from IP'switching reaction and heats of formation
Δr106.kJ/molPHPMSMeot-Ner (Mautner) and Field, 1974gas phase; ΔrH>, DG>
Quantity Value Units Method Reference Comment
Δr84.J/mol*KPHPMSMeot-Ner (Mautner) and Field, 1974gas phase; ΔrH>, DG>

Free energy of reaction

ΔrG° (kJ/mol) T (K) Method Reference Comment
21.340.HPMSChong and Franklin, 1971gas phase; equilibrium uncertain
48.1695.PHPMSMeot-Ner (Mautner) and Field, 1974gas phase; ΔrH>, DG>

(CO+ • Carbon monoxide) + Carbon monoxide = (CO+ • 2Carbon monoxide)

By formula: (CO+ • CO) + CO = (CO+ • 2CO)

Quantity Value Units Method Reference Comment
Δr52.3kJ/molPHPMSHiraoka and Mori, 1991gas phase
Δr15.kJ/molPILinn, Ono, et al., 1981gas phase
Quantity Value Units Method Reference Comment
Δr149.J/mol*KPHPMSHiraoka and Mori, 1991gas phase

(CO+ • 2Carbon monoxide) + Carbon monoxide = (CO+ • 3Carbon monoxide)

By formula: (CO+ • 2CO) + CO = (CO+ • 3CO)

Quantity Value Units Method Reference Comment
Δr30.2kJ/molPHPMSHiraoka and Mori, 1991gas phase; two isomers, at low and high temperatures
Quantity Value Units Method Reference Comment
Δr103.J/mol*KPHPMSHiraoka and Mori, 1991gas phase; two isomers, at low and high temperatures

(CO+ • 3Carbon monoxide) + Carbon monoxide = (CO+ • 4Carbon monoxide)

By formula: (CO+ • 3CO) + CO = (CO+ • 4CO)

Quantity Value Units Method Reference Comment
Δr18.4kJ/molPHPMSHiraoka and Mori, 1991gas phase; two isomers
Quantity Value Units Method Reference Comment
Δr85.8J/mol*KPHPMSHiraoka and Mori, 1991gas phase; two isomers

(CO+ • 4Carbon monoxide) + Carbon monoxide = (CO+ • 5Carbon monoxide)

By formula: (CO+ • 4CO) + CO = (CO+ • 5CO)

Quantity Value Units Method Reference Comment
Δr17.8kJ/molPHPMSHiraoka and Mori, 1991gas phase; two isomers
Quantity Value Units Method Reference Comment
Δr102.J/mol*KPHPMSHiraoka and Mori, 1991gas phase; two isomers

(CO+ • 5Carbon monoxide) + Carbon monoxide = (CO+ • 6Carbon monoxide)

By formula: (CO+ • 5CO) + CO = (CO+ • 6CO)

Quantity Value Units Method Reference Comment
Δr11.3kJ/molPHPMSHiraoka and Mori, 1991gas phase; two isomers, at low and high temperatures
Quantity Value Units Method Reference Comment
Δr79.9J/mol*KPHPMSHiraoka and Mori, 1991gas phase; two isomers, at low and high temperatures

(CO+ • 6Carbon monoxide) + Carbon monoxide = (CO+ • 7Carbon monoxide)

By formula: (CO+ • 6CO) + CO = (CO+ • 7CO)

Quantity Value Units Method Reference Comment
Δr9.41kJ/molPHPMSHiraoka and Mori, 1991gas phase; break in the van't Hoff plot
Quantity Value Units Method Reference Comment
Δr88.3J/mol*KPHPMSHiraoka and Mori, 1991gas phase; break in the van't Hoff plot

(CO+ • 7Carbon monoxide) + Carbon monoxide = (CO+ • 8Carbon monoxide)

By formula: (CO+ • 7CO) + CO = (CO+ • 8CO)

Quantity Value Units Method Reference Comment
Δr6.61kJ/molPHPMSHiraoka and Mori, 1991gas phase; break in the van't Hoff plot
Quantity Value Units Method Reference Comment
Δr51.9J/mol*KPHPMSHiraoka and Mori, 1991gas phase; break in the van't Hoff plot

(CO+ • 9Carbon monoxide) + Carbon monoxide = (CO+ • 10Carbon monoxide)

By formula: (CO+ • 9CO) + CO = (CO+ • 10CO)

Quantity Value Units Method Reference Comment
Δr7.74kJ/molPHPMSHiraoka and Mori, 1991gas phase
Quantity Value Units Method Reference Comment
Δr79.9J/mol*KPHPMSHiraoka and Mori, 1991gas phase

(CO+ • 11Carbon monoxide) + Carbon monoxide = (CO+ • 12Carbon monoxide)

By formula: (CO+ • 11CO) + CO = (CO+ • 12CO)

Quantity Value Units Method Reference Comment
Δr8.91kJ/molPHPMSHiraoka and Mori, 1991gas phase
Quantity Value Units Method Reference Comment
Δr113.J/mol*KPHPMSHiraoka and Mori, 1991gas phase

(CO+ • 12Carbon monoxide) + Carbon monoxide = (CO+ • 13Carbon monoxide)

By formula: (CO+ • 12CO) + CO = (CO+ • 13CO)

Quantity Value Units Method Reference Comment
Δr8.79kJ/molPHPMSHiraoka and Mori, 1991gas phase
Quantity Value Units Method Reference Comment
Δr116.J/mol*KPHPMSHiraoka and Mori, 1991gas phase

(CO+ • 13Carbon monoxide) + Carbon monoxide = (CO+ • 14Carbon monoxide)

By formula: (CO+ • 13CO) + CO = (CO+ • 14CO)

Quantity Value Units Method Reference Comment
Δr8.70kJ/molPHPMSHiraoka and Mori, 1991gas phase
Quantity Value Units Method Reference Comment
Δr120.J/mol*KPHPMSHiraoka and Mori, 1991gas phase

(CO+ • 14Carbon monoxide) + Carbon monoxide = (CO+ • 15Carbon monoxide)

By formula: (CO+ • 14CO) + CO = (CO+ • 15CO)

Quantity Value Units Method Reference Comment
Δr8.03kJ/molPHPMSHiraoka and Mori, 1991gas phase
Quantity Value Units Method Reference Comment
Δr112.J/mol*KPHPMSHiraoka and Mori, 1991gas phase

(CO+ • 15Carbon monoxide) + Carbon monoxide = (CO+ • 16Carbon monoxide)

By formula: (CO+ • 15CO) + CO = (CO+ • 16CO)

Quantity Value Units Method Reference Comment
Δr8.03kJ/molPHPMSHiraoka and Mori, 1991gas phase
Quantity Value Units Method Reference Comment
Δr115.J/mol*KPHPMSHiraoka and Mori, 1991gas phase

(CO+ • 16Carbon monoxide) + Carbon monoxide = (CO+ • 17Carbon monoxide)

By formula: (CO+ • 16CO) + CO = (CO+ • 17CO)

Quantity Value Units Method Reference Comment
Δr7.87kJ/molPHPMSHiraoka and Mori, 1991gas phase
Quantity Value Units Method Reference Comment
Δr115.J/mol*KPHPMSHiraoka and Mori, 1991gas phase

References

Norwood, Guo, et al., 1989
Norwood, K.; Guo, J.H.; Luo, G.; Ng, C.Y., A Study of Intramolecular Charge Transfer in Mixed Ar/Co Dimer and Trimer Ions Using the Photoion - Photoelectron Coincidence Method, Chem. Phys., 1989, 129, 1, 109, https://doi.org/10.1016/0301-0104(89)80023-0 . [all data]

Norwood, Guo, et al., 1988
Norwood, K.; Guo, J.H.; Luo, G.; Ng, C.Y., A Photoion - Photoelectron Coincidence Study of (CO)2, J. Chem. Phys., 1988, 88, 6, 4098, https://doi.org/10.1063/1.453814 . [all data]

Linn, Ono, et al., 1981
Linn, S.H.; Ono, Y.; Ng, C.Y., Molecular Beam Photoionization Study of CO, N2, and NO Dimers and Clusters, J. Chem. Phys., 1981, 74, 6, 3342, https://doi.org/10.1063/1.441486 . [all data]

Munson and Franlin, 1962
Munson, M.S.B. Field; Franlin, J.L., High-Pressure Mass Spectrometric Study of Reactions of Rare Gases with N2 and CO, J. Chem. Phys., 1962, 37, 8, 1790, https://doi.org/10.1063/1.1733370 . [all data]

Meot-Ner (Mautner) and Field, 1974
Meot-Ner (Mautner), M.; Field, F.H., Kinetics and Thermodynamics of the Association of CO+ with CO and of N2+ with N2 between 120 and 650 K, J. Chem. Phys., 1974, 61, 9, 3742, https://doi.org/10.1063/1.1682560 . [all data]

Chong and Franklin, 1971
Chong, S.L.; Franklin, J.L., High-Pressure Ion-Molecule Reactions in Carbon Monoxide and Carbon Monoxide - Methane Mixtures, J. Chem. Phys., 1971, 54, 4, 1487, https://doi.org/10.1063/1.1675043 . [all data]

Hiraoka and Mori, 1991
Hiraoka, K.; Mori, T., On the formation of the Isomeric Cluster Ions (CO)n+, J. Chem. Phys., 1991, 94, 4, 2697, https://doi.org/10.1063/1.459844 . [all data]