Oxiranecarboxylic acid, 3-phenyl-, ethyl ester

Phase change data

Data compiled by: Robert L. Brown and Stephen E. Stein

Reduced pressure boiling point

Tboil (K) Pressure (atm) Reference
369.20.0007Aldrich Chemical Company Inc., 1990

Van Den Dool and Kratz RI, non-polar column, temperature ramp

View large format table.

Column type Active phase I Reference Comment
CapillaryHP-51529.David, Scanlan, et al., 200050. m/0.32 mm/1.05 μm, He, 2. K/min; Tstart: 50. C; Tend: 290. C

Normal alkane RI, non-polar column, custom temperature program

View large format table.

Column type Active phase I Reference Comment
CapillaryHP-51529.0David, Scanlan, et al., 200250. m/0.32 mm/1.05 μm, He; Program: not specified

References

Aldrich Chemical Company Inc., 1990
Aldrich Chemical Company Inc., Catalog Handbook of Fine Chemicals, Aldrich Chemical Company, Inc., Milwaukee WI, 1990, 1. [all data]

David, Scanlan, et al., 2000
David, F.; Scanlan, F.; Sandra, P., Retention time locking in flavor analysis, Proceedings 23rd ISCC; CD-ROM, 2000, retrieved from http://www.richrom.com/assets/CD23PDF. [all data]

David, Scanlan, et al., 2002
David, F.; Scanlan, F.; Sandra, P.; Szelewski, M., Analysis of essential oil compounds using retention time locked methods and retention time databases, 2002, retrieved from http://www.chem.agilent.com. [all data]