Platinum monosilicide

Gas phase ion energetics data

Data compiled by: Henry M. Rosenstock, Keith Draxl, Bruce W. Steiner, and John T. Herron

Ionization energy determinations

IE (eV) Method Reference
7.9 ± 0.5EIAuwera-Mahieu, Peeters, et al., 1970

References

Auwera-Mahieu, Peeters, et al., 1970
Auwera-Mahieu, A.V.; Peeters, R.; McIntyre, N.S.; Drowart, J., Mass spectrometric determination of dissociation energies of the borides and suicides of some transition metals, J. Chem. Soc. Faraday Trans., 1970, 66, 809. [all data]