C12H3N5

Gas phase ion energetics data

Data compiled by: John E. Bartmess

De-protonation reactions

C12H2N5- + Hydrogen cation = C12H3N5

By formula: C12H2N5- + H+ = C12H3N5

Quantity Value Units Method Reference Comment
Δr301.6 ± 2.0kcal/molIMRELeito, Raamat, et al., 2009gas phase
Δr302.1 ± 2.0kcal/molIMREKoppel, Koppel, et al., 2000gas phase

References

Leito, Raamat, et al., 2009
Leito, I.; Raamat, E.; Kutt, A.; Saame, J.; Kipper, K.; Koppel, I.A.; Koppel, I.; Zhang, M.; Mishima, M.; Yagupolskii, L.M.; Garlyauskayte, R.Y.; Filatov, A.A., Revision of the Gas-Phase Acidity Scale below 300 kcal mol(-1), J. Phys. Chem. A, 2009, 113, 29, 8421-8424, https://doi.org/10.1021/jp903780k . [all data]

Koppel, Koppel, et al., 2000
Koppel, I.A.; Koppel, J.; Pihl, V.; Leito, I.; Mishima, M.; Vlasov, V.M.; Yagupolskii, L.M.; Taft, R.W., Comparison of Bronsted acidities of neutral CH acids in gas phase and dimethyl sulfoxide, J. Chem. Soc. Perkin Trans., 2000, 2, 6, 1125-1133, https://doi.org/10.1039/b001792m . [all data]