dipotassium oxide

Condensed phase thermochemistry data

Quantity Value Units Method Reference Comment
Δfsolid-86.800kcal/molReviewChase, 1998Data last reviewed in June, 1963
Quantity Value Units Method Reference Comment
solid22.47cal/mol*KReviewChase, 1998Data last reviewed in June, 1963

Solid Phase Heat Capacity (Shomate Equation)

Cp° = A + B*t + C*t2 + D*t3 + E/t2
H° − H°298.15= A*t + B*t2/2 + C*t3/3 + D*t4/4 − E/t + F − H
S° = A*ln(t) + B*t + C*t2/2 + D*t3/3 − E/(2*t2) + G
    Cp = heat capacity (cal/mol*K)
    H° = standard enthalpy (kcal/mol)
    S° = standard entropy (cal/mol*K)
    t = temperature (K) / 1000.

View plot Requires a JavaScript / HTML 5 canvas capable browser.

View table.

Temperature (K) 298. - 700.700. - 2000.
A 58.5588917.34010
B -135.52809.892680
C 186.1190-0.174115
D -82.759110.052238
E -1.1121800.015781
F -103.4560-92.29469
G 119.950040.76551
H -86.80000-86.80000
ReferenceChase, 1998Chase, 1998
Comment Data last reviewed in June, 1963 Data last reviewed in June, 1963

Gas phase ion energetics data

Data evaluated as indicated in comments:
HL - Edward P. Hunter and Sharon G. Lias

Data compiled as indicated in comments:
LBLHLM - Sharon G. Lias, John E. Bartmess, Joel F. Liebman, John L. Holmes, Rhoda D. Levin, and W. Gary Mallard
LLK - Sharon G. Lias, Rhoda D. Levin, and Sherif A. Kafafi
RDSH - Henry M. Rosenstock, Keith Draxl, Bruce W. Steiner, and John T. Herron

Quantity Value Units Method Reference Comment
Proton affinity (review)320.87kcal/molN/AHunter and Lias, 1998HL
Quantity Value Units Method Reference Comment
Gas basicity313.53kcal/molN/AHunter and Lias, 1998HL

Ionization energy determinations

IE (eV) Method Reference Comment
4.7 ± 0.4PIDao, Peterson, et al., 1984LBLHLM
4.96SButman, Kudin, et al., 1984LBLHLM
7.5 ± 1.0SFarber, Srivastava, et al., 1982LBLHLM
10.7 ± 0.3EISimmons, Lowden, et al., 1977LLK
7.5 ± 0.1EIEhlert, 1977LLK
7.5 ± 0.2EIEhlert, 1977LLK
~5.EIGusarov and Gorokhov, 1966RDSH

References

Chase, 1998
Chase, M.W., Jr., NIST-JANAF Themochemical Tables, Fourth Edition, J. Phys. Chem. Ref. Data, Monograph 9, 1998, 1-1951. [all data]

Hunter and Lias, 1998
Hunter, E.P.; Lias, S.G., Evaluated Gas Phase Basicities and Proton Affinities of Molecules: An Update, J. Phys. Chem. Ref. Data, 1998, 27, 3, 413-656, https://doi.org/10.1063/1.556018 . [all data]

Dao, Peterson, et al., 1984
Dao, P.D.; Peterson, K.I.; Castleman, A.W., Jr., The photoionization of oxidized metal clusters, J. Chem. Phys., 1984, 80, 563. [all data]

Butman, Kudin, et al., 1984
Butman, M.F.; Kudin, L.S.; Krasnov, K.S., The Mass-spectrometric determination of the proton affinity of the molecules M2O (M = Na, K, Rb, Cs), Russ. J. Inorg. Chem., 1984, 29, 1228, In original 2150. [all data]

Farber, Srivastava, et al., 1982
Farber, M.; Srivastava, R.D.; Moyer, J.W., Mass spectrometric determination of the thermodynamics of potassium hydroxide and minor potassium-containing species required in magnetohydrodynamic power systems, J. Chem. Thermodyn., 1982, 14, 1103. [all data]

Simmons, Lowden, et al., 1977
Simmons, L.L.; Lowden, L.F.; Ehlert, T.C., A mass spectrometric study of K2CO3 and K2O, J. Phys. Chem., 1977, 81, 706. [all data]

Ehlert, 1977
Ehlert, T.C., Mass spectrometric investigations of the oxides of potassium, High Temp. Sci., 1977, 9, 237. [all data]

Gusarov and Gorokhov, 1966
Gusarov, A.V.; Gorokhov, L.N., Vapor composition over potassium oxide, Teplofiz. Vysokikh Temperatur, 1966, 4, 590, In original 558. [all data]