Cerium disulfide

Gas phase ion energetics data

Data compiled by: Sharon G. Lias, Rhoda D. Levin, and Sherif A. Kafafi

Ionization energy determinations

IE (eV) Method Reference
14. ± 1.EIGingerich, Pupp, et al., 1972

References

Gingerich, Pupp, et al., 1972
Gingerich, K.A.; Pupp, C.; Campbell, B.E., Mass spectrometric determination of the heats of atomization of the molecules Ce2S, CeS2, Ce2S2, Ce2S3, High Temp. Sci., 1972, 4, 236. [all data]