Molybdenum,bis[(1,2,3,4,5,6-η)-methylbenzene]-

Gas phase ion energetics data

Data compiled by: Sharon G. Lias, Rhoda D. Levin, and Sherif A. Kafafi

Ionization energy determinations

IE (eV) Method Reference Comment
5.32 ± 0.05PEEvans, Green, et al., 1974Vertical value

References

Evans, Green, et al., 1974
Evans, S.; Green, J.C.; Jackson, S.E.; Higginson, B., He(I) photoelectron spectra of some transition-metal sandwich complexes, J. Chem. Soc. Dalton Trans., 1974, 304. [all data]