1,3-Dimethylbenzenechromium tricarbonyl

Gas phase ion energetics data

Data compiled by: Henry M. Rosenstock, Keith Draxl, Bruce W. Steiner, and John T. Herron

Ionization energy determinations

IE (eV) Method Reference
7.35 ± 0.04CTSHuttner and Fischer, 1967

References

Huttner and Fischer, 1967
Huttner, G.; Fischer, E.O., Uber Aromatenkomplexe von Metallen. XCVIII. Spectroskopische Untersuchungen an Charge-Transfer-Komplexen von Aromaten-Chrom Tricarbonylen mit 1,3,5-Trinitrobenzol, J. Organometal. Chem., 1967, 8, 299. [all data]